BDBM50245249 CHEMBL452584::N-(Benzyloxycarbonyl)-L-leucyl-L-phenylalanine methyl ester
SMILES COC(=O)[C@H](Cc1ccccc1)NC(=O)[C@H](CC(C)C)NC(=O)OCc1ccccc1
InChI Key InChIKey=MXMAVZMWYSUCJZ-SFTDATJTSA-N
Data  6 IC50
  Tab Delimited (TSV)   2D SDfile   Computed 3D by Vconf -m prep SDfile
Find this compound or compounds like it in BindingDB:
Activity Spreadsheet -- Enzyme Inhibition Constant Data from BindingDB
Found 1 hit for monomerid = 50245249
TargetMatrix metalloproteinase-9(Homo sapiens (Human))
Università
Curated by ChEMBL
LigandPNGBDBM50245249(CHEMBL452584 | N-(Benzyloxycarbonyl)-L-leucyl-L-ph...)
Affinity DataIC50: >3.00E+5nM. Assay description: Inhibition of human recombinant MMP9
In DepthDetails ArticlePubMed